Target
NAD-dependent protein deacetylase sirtuin-2
Ligand
BDBM50392055
Substrate
Meas. Tech.
ChEMBL_851437 (CHEMBL2156443)
IC50
570±n/a nM
Citation
 Suzuki, TKhan, MNSawada, HImai, EItoh, YYamatsuta, KTokuda, NTakeuchi, JSeko, TNakagawa, HMiyata, N Design, synthesis, and biological activity of a novel series of human sirtuin-2-selective inhibitors. J Med Chem 55:5760-73 (2012)  
Target
Name:
NAD-dependent protein deacetylase sirtuin-2
Synonyms:
NAD-Dependent Deacetylase Sirtuin-2 NAD-dependent deacetylase sirtuin 3 SIR2-like SIR2L SIR2_HUMAN Sirtuin 2 (SIRT2)
Type:
Hydrolase
Mol. Mass.:
43172.62
Organism:
Homo sapiens (Human)
Description:
Residue:
389
  
Inhibitor
Name:
BDBM50392055
Synonyms:
CHEMBL2152621
Type:
Small organic molecule
Emp. Form.:
C21H19FN2O2
Mol. Mass.:
350.3862
SMILES:
NC(=O)c1ccccc1Nc1cccc(OCCc2cccc(F)c2)c1
: