Target
KiSS-1 receptor
Ligand
BDBM50392405
Substrate
Meas. Tech.
ChEMBL_851682 (CHEMBL2155899)
IC50
0.17±n/a nM
Citation
 Asami, TNishizawa, NIshibashi, YNishibori, KNakayama, MHorikoshi, YMatsumoto, SYamaguchi, MMatsumoto, HTarui, NOhtaki, TKitada, C Serum stability of selected decapeptide agonists of KISS1R using pseudopeptides. Bioorg Med Chem Lett 22:6391-6 (2012)  
Target
Name:
KiSS-1 receptor
Synonyms:
Gpr54 Kiss1r
Type:
PROTEIN
Mol. Mass.:
42915.37
Organism:
Rattus norvegicus
Description:
ChEMBL_1448383
Residue:
396
  
Inhibitor
Name:
BDBM50392405
Synonyms:
CHEMBL2151646
Type:
Small organic molecule
Emp. Form.:
C63H84N18O14
Mol. Mass.:
1317.4533
SMILES:
CNC(N)=NCCC[C@H](NC(=O)[C@H](CC(C)C)NC(=O)NNC(=O)[C@H](Cc1ccccc1)NC(=O)[C@H](CO)NC(=O)[C@H](CC(N)=O)NC(=O)[C@H](Cc1c[nH]c2ccccc12)NC(=O)[C@H](CC(N)=O)NC(=O)[C@H](N)Cc1ccc(O)cc1)C(=O)N[C@@H](Cc1ccccc1)C(N)=O
: