Target
Metabotropic glutamate receptor 5
Ligand
BDBM50392425
Substrate
Meas. Tech.
ChEMBL_851727 (CHEMBL2156069)
EC50
33±n/a nM
Citation
 Manka, JTVinson, PNGregory, KJZhou, YWilliams, RGogi, KDays, EJadhav, SHerman, EJLavreysen, HMackie, CBartolomé, JMMacdonald, GJSteckler, TDaniels, JSWeaver, CDNiswender, CMJones, CKConn, PJLindsley, CWStauffer, SR Optimization of an ether series of mGlu5 positive allosteric modulators: molecular determinants of MPEP-site interaction crossover. Bioorg Med Chem Lett 22:6481-5 (2012)  
Target
Name:
Metabotropic glutamate receptor 5
Synonyms:
GRM5_RAT Grm5 Mglur5 metabotropic glutamate 5/1-C metabotropic glutamate 5a
Type:
Enzyme
Mol. Mass.:
131900.14
Organism:
Rattus norvegicus (Rat)
Description:
P31424
Residue:
1203
  
Inhibitor
Name:
BDBM50392425
Synonyms:
CHEMBL2151790
Type:
Small organic molecule
Emp. Form.:
C17H17F2NO2
Mol. Mass.:
305.3192
SMILES:
CCCCOc1ccc(cc1)C(=O)Nc1ccc(F)cc1F
: