Target
Metabotropic glutamate receptor 5
Ligand
BDBM50392447
Substrate
Meas. Tech.
ChEMBL_851727 (CHEMBL2156069)
EC50
15±n/a nM
Citation
 Manka, JTVinson, PNGregory, KJZhou, YWilliams, RGogi, KDays, EJadhav, SHerman, EJLavreysen, HMackie, CBartolomé, JMMacdonald, GJSteckler, TDaniels, JSWeaver, CDNiswender, CMJones, CKConn, PJLindsley, CWStauffer, SR Optimization of an ether series of mGlu5 positive allosteric modulators: molecular determinants of MPEP-site interaction crossover. Bioorg Med Chem Lett 22:6481-5 (2012)  
Target
Name:
Metabotropic glutamate receptor 5
Synonyms:
GRM5_RAT Grm5 Mglur5 metabotropic glutamate 5/1-C metabotropic glutamate 5a
Type:
Enzyme
Mol. Mass.:
131900.14
Organism:
Rattus norvegicus (Rat)
Description:
P31424
Residue:
1203
  
Inhibitor
Name:
BDBM50392447
Synonyms:
CHEMBL2151815
Type:
Small organic molecule
Emp. Form.:
C21H25FN2O2
Mol. Mass.:
356.4338
SMILES:
C[C@@H](NC(=O)c1ccc(OCc2cccc(F)c2)nc1)C1CCCCC1
: