Target
Alpha-1B adrenergic receptor
Ligand
BDBM50392643
Substrate
Meas. Tech.
ChEMBL_854048 (CHEMBL2155389)
Kd
8.91±n/a nM
Citation
 Fumagalli, LPallavicini, MBudriesi, RGobbi, MStraniero, VZagami, MChiodini, GBolchi, CChiarini, AMicucci, MValoti, E Affinity and activity profiling of unichiral 8-substituted 1,4-benzodioxane analogues of WB4101 reveals a potent and selectivea1B-adrenoceptor antagonist. Eur J Med Chem 58:184-91 (2012)  
Target
Name:
Alpha-1B adrenergic receptor
Synonyms:
ADA1B_RAT Alpha 1B-adrenoceptor Alpha adrenergic receptor 1A and 1B Alpha-1Adrenoceptor Alpha-1B adrenoreceptor | adrenergic Alpha1B
Type:
G Protein-Coupled Receptor (GPCR)
Mol. Mass.:
56606.71
Organism:
Rattus norvegicus (rat)
Description:
Receptor binding assays were performed using rat cortical membranes.
Residue:
515
  
Inhibitor
Name:
BDBM50392643
Synonyms:
CHEMBL2153555
Type:
Small organic molecule
Emp. Form.:
C19H22ClNO5
Mol. Mass.:
379.835
SMILES:
COc1cccc(OC)c1OCCNC[C@H]1COc2cccc(Cl)c2O1
: