Target
Cannabinoid receptor 1
Ligand
BDBM50392708
Substrate
Meas. Tech.
ChEMBL_854280 (CHEMBL2154446)
Ki
>1000±n/a nM
Citation
 Gembus, VFurman, CMillet, RMansouri, RChavatte, PLevacher, VBrière, JF Scaffold hopping strategy toward original pyrazolines as selective CB2 receptor ligands. Eur J Med Chem 58:396-404 (2012)  
Target
Name:
Cannabinoid receptor 1
Synonyms:
CANN6 CB-R CNR CNR1_HUMAN Cannabinoid receptor Cannabinoid receptor 1 (brain)
Type:
G Protein-Coupled Receptor (GPCR)
Mol. Mass.:
52868.96
Organism:
Homo sapiens (Human)
Description:
P21554
Residue:
472
  
Inhibitor
Name:
BDBM50392708
Synonyms:
CHEMBL2151377
Type:
Small organic molecule
Emp. Form.:
C28H34ClN3O
Mol. Mass.:
464.042
SMILES:
Cc1cc(ccc1Cl)C1=NN(CC1Cc1ccccc1)C(=O)NC1C(C)(C)C2CCC1(C)C2
: