Target
Cannabinoid receptor 2
Ligand
BDBM50392709
Substrate
Meas. Tech.
ChEMBL_854281 (CHEMBL2154447)
Ki
>1000±n/a nM
Citation
 Gembus, VFurman, CMillet, RMansouri, RChavatte, PLevacher, VBrière, JF Scaffold hopping strategy toward original pyrazolines as selective CB2 receptor ligands. Eur J Med Chem 58:396-404 (2012)  
Target
Name:
Cannabinoid receptor 2
Synonyms:
CANNABINOID CB2 CB2 CB2B CNR2_HUMAN Cannabinoid CB2 receptor Cannabinoid receptor 2 (CB2R) | hCB2
Type:
G Protein-Coupled Receptor (GPCR)
Mol. Mass.:
39690.94
Organism:
Homo sapiens (Human)
Description:
P34972
Residue:
360
  
Inhibitor
Name:
BDBM50392709
Synonyms:
CHEMBL2151378
Type:
Small organic molecule
Emp. Form.:
C25H24ClN3O
Mol. Mass.:
417.931
SMILES:
Cc1ccc(CC2CN(N=C2c2ccc(Cl)c(C)c2)C(=O)Nc2ccccc2)cc1
: