Target
Alpha-1D adrenergic receptor
Ligand
BDBM50393116
Substrate
Meas. Tech.
ChEMBL_852796 (CHEMBL2156103)
Kd
0.0251±n/a nM
Citation
 Romeiro, LAda Silva Ferreira, Mda Silva, LLCastro, HCMiranda, ALSilva, CLNoël, FNascimento, JBAraújo, CVTibiriçá, EBarreiro, EJFraga, CA Discovery of LASSBio-772, a 1,3-benzodioxole N-phenylpiperazine derivative with potent alpha 1A/D-adrenergic receptor blocking properties. Eur J Med Chem 46:3000-12 (2011)  
Target
Name:
Alpha-1D adrenergic receptor
Synonyms:
ADA1D_RAT Adra1d Alpha-1D adrenergic receptor | Serotonin 1a (5-HT1a) receptor/Adrenergic receptor alpha-1
Type:
Protein
Mol. Mass.:
59375.97
Organism:
Rattus norvegicus (Rat)
Description:
P23944
Residue:
561
  
Inhibitor
Name:
BDBM50393116
Synonyms:
CHEMBL2153423
Type:
Small organic molecule
Emp. Form.:
C20H24N2O3
Mol. Mass.:
340.4162
SMILES:
COc1ccccc1N1CCN(CCc2ccc3OCOc3c2)CC1
: