Target
Farnesyl pyrophosphate synthase
Ligand
BDBM50098390
Substrate
Meas. Tech.
ChEMBL_850739 (CHEMBL2156008)
Ki
11±n/a nM
Citation
 Mucha, AKafarski, PBerlicki, L Remarkable potential of thea-aminophosphonate/phosphinate structural motif in medicinal chemistry. J Med Chem 54:5955-80 (2011)  
Target
Name:
Farnesyl pyrophosphate synthase
Synonyms:
FPPS
Type:
PROTEIN
Mol. Mass.:
40961.27
Organism:
Leishmania major
Description:
ChEMBL_850739
Residue:
362
  
Inhibitor
Name:
BDBM50098390
Synonyms:
(3-methylpyridin-2-ylamino)methylenediphosphonic acid 2-{[hydrogen phosphonato(phosphonato)methyl]amino}-3-methylpyridin-1-ium [(3-Methyl-pyridin-2-ylamino)-phosphono-methyl]-phosphonic acid(NE97200) | [(3-methyl-pyridin-2-ylamino)-phosphono-methyl]-phosphonic acid
Type:
Small organic molecule
Emp. Form.:
C7H12N2O6P2
Mol. Mass.:
282.1275
SMILES:
Cc1cccnc1NC(P(O)(O)=O)P(O)(O)=O
: