Target
Collagenase 3
Ligand
BDBM50393207
Substrate
Meas. Tech.
ChEMBL_850712 (CHEMBL2155981)
Ki
>200000±n/a nM
Citation
 Mucha, AKafarski, PBerlicki, L Remarkable potential of thea-aminophosphonate/phosphinate structural motif in medicinal chemistry. J Med Chem 54:5955-80 (2011)  
Target
Name:
Collagenase 3
Synonyms:
MMP-13 MMP13_HUMAN Matrix metalloproteinase-13 (MMP-13) | Matrix metalloproteinase-13 (MMP13)
Type:
Enzyme
Mol. Mass.:
53808.06
Organism:
Homo sapiens (Human)
Description:
P45452
Residue:
471
  
Inhibitor
Name:
BDBM50393207
Synonyms:
CHEMBL2153738
Type:
Small organic molecule
Emp. Form.:
C37H36F3N4O7PS
Mol. Mass.:
768.738
SMILES:
NC(=O)[C@H](Cc1c[nH]c2ccccc12)NC(=O)[C@@H](CP(O)(=O)[C@H](Cc1ccccc1)NC(=O)OCc1ccccc1)Sc1ccccc1OC(F)(F)F
: