Target
Aminopeptidase N
Ligand
BDBM50129683
Substrate
Meas. Tech.
ChEMBL_850721 (CHEMBL2155990)
Ki
1015±n/a nM
Citation
 Mucha, AKafarski, PBerlicki, L Remarkable potential of thea-aminophosphonate/phosphinate structural motif in medicinal chemistry. J Med Chem 54:5955-80 (2011)  
Target
Name:
Aminopeptidase N
Synonyms:
AMPN_HUMAN APN Aminopeptidase CD_antigen=CD13 Myeloid plasma membrane glycoprotein CD13 gp150 | hAPN
Type:
PROTEIN
Mol. Mass.:
109522.63
Organism:
Homo sapiens (Human)
Description:
ChEMBL_1507526
Residue:
967
  
Inhibitor
Name:
BDBM50129683
Synonyms:
2-[(1-Amino-3-methyl-butyl)-hydroxy-phosphinoylmethyl]-4-methyl-pentanoic acid CHEMBL328319 | Diastereomer-2-[(1-Amino-3-methyl-butyl)-hydroxy-phosphinoylmethyl]-4-methyl-pentanoic acid
Type:
Small organic molecule
Emp. Form.:
C12H26NO4P
Mol. Mass.:
279.3129
SMILES:
CC(C)CC(CP(O)(O)C(=N)CC(C)C)C(O)=O
: