Target
Aminopeptidase N
Ligand
BDBM50393210
Substrate
Meas. Tech.
ChEMBL_850721 (CHEMBL2155990)
Ki
2.2±n/a nM
Citation
 Mucha, AKafarski, PBerlicki, L Remarkable potential of thea-aminophosphonate/phosphinate structural motif in medicinal chemistry. J Med Chem 54:5955-80 (2011)  
Target
Name:
Aminopeptidase N
Synonyms:
AMPN_HUMAN APN Aminopeptidase CD_antigen=CD13 Myeloid plasma membrane glycoprotein CD13 gp150 | hAPN
Type:
PROTEIN
Mol. Mass.:
109522.63
Organism:
Homo sapiens (Human)
Description:
ChEMBL_1507526
Residue:
967
  
Inhibitor
Name:
BDBM50393210
Synonyms:
CHEMBL1235787
Type:
Small organic molecule
Emp. Form.:
C21H27N2O5P
Mol. Mass.:
418.4232
SMILES:
CC(=N)P(O)(O)C[C@@H](Cc1ccccc1)C(=O)N[C@@H](Cc1ccccc1)C(O)=O
: