Target
Neuronal acetylcholine receptor subunit alpha-7
Ligand
BDBM50393241
Substrate
Meas. Tech.
ChEMBL_851150 (CHEMBL2157807)
Ki
9.6±n/a nM
Citation
 Mazurov, AASpeake, JDYohannes, D Discovery and development ofa7 nicotinic acetylcholine receptor modulators. J Med Chem 54:7943-61 (2011)  
Target
Name:
Neuronal acetylcholine receptor subunit alpha-7
Synonyms:
ACHA7_HUMAN Cholinergic, Nicotinic Alpha7 Neuronal acetylcholine receptor protein alpha-7 subunit Nicotinic acetylcholine receptor alpha-7 (alpha7 nAChR)
Type:
Mol. Mass.:
56448.33
Organism:
Homo sapiens (Human)
Description:
CHRNA7 (NACHRA7)
Residue:
502
  
Inhibitor
Name:
BDBM50393241
Synonyms:
CHEMBL2151445
Type:
Small organic molecule
Emp. Form.:
C18H21N3
Mol. Mass.:
279.3794
SMILES:
CN1CC2CN(CC2C1)c1ccc(nc1)-c1ccccc1
: