Target
Neuronal acetylcholine receptor subunit alpha-7
Ligand
BDBM50190788
Substrate
Meas. Tech.
ChEMBL_851150 (CHEMBL2157807)
Ki
1.6±n/a nM
Citation
 Mazurov, AASpeake, JDYohannes, D Discovery and development ofa7 nicotinic acetylcholine receptor modulators. J Med Chem 54:7943-61 (2011)  
Target
Name:
Neuronal acetylcholine receptor subunit alpha-7
Synonyms:
ACHA7_HUMAN Cholinergic, Nicotinic Alpha7 Neuronal acetylcholine receptor protein alpha-7 subunit Nicotinic acetylcholine receptor alpha-7 (alpha7 nAChR)
Type:
Mol. Mass.:
56448.33
Organism:
Homo sapiens (Human)
Description:
CHRNA7 (NACHRA7)
Residue:
502
  
Inhibitor
Name:
BDBM50190788
Synonyms:
CHEMBL378471 | N-[(3R)-1-azabicyclo[2.2.2]oct-3-yl]-1-benzofuran-5-carboxamide
Type:
Small organic molecule
Emp. Form.:
C16H18N2O2
Mol. Mass.:
270.3263
SMILES:
O=C(N[C@H]1CN2CCC1CC2)c1ccc2occc2c1
: