Target
Neuronal acetylcholine receptor subunit alpha-7
Ligand
BDBM50393248
Substrate
Meas. Tech.
ChEMBL_851189 (CHEMBL2157846)
Ki
6±n/a nM
Citation
 Mazurov, AASpeake, JDYohannes, D Discovery and development ofa7 nicotinic acetylcholine receptor modulators. J Med Chem 54:7943-61 (2011)  
Target
Name:
Neuronal acetylcholine receptor subunit alpha-7
Synonyms:
ACHA7_HUMAN Cholinergic, Nicotinic Alpha7 Neuronal acetylcholine receptor protein alpha-7 subunit Nicotinic acetylcholine receptor alpha-7 (alpha7 nAChR)
Type:
Mol. Mass.:
56448.33
Organism:
Homo sapiens (Human)
Description:
CHRNA7 (NACHRA7)
Residue:
502
  
Inhibitor
Name:
BDBM50393248
Synonyms:
CHEMBL1258005
Type:
Small organic molecule
Emp. Form.:
C20H22BrN3O
Mol. Mass.:
400.312
SMILES:
Brc1ccc(cc1)C(=O)N[C@@H]1C2CCN(CC2)[C@H]1Cc1cccnc1
: