Target
Neuronal acetylcholine receptor subunit alpha-7
Ligand
BDBM50164959
Substrate
Meas. Tech.
ChEMBL_851150 (CHEMBL2157807)
Ki
167±n/a nM
Citation
 Mazurov, AASpeake, JDYohannes, D Discovery and development ofa7 nicotinic acetylcholine receptor modulators. J Med Chem 54:7943-61 (2011)  
Target
Name:
Neuronal acetylcholine receptor subunit alpha-7
Synonyms:
ACHA7_HUMAN Cholinergic, Nicotinic Alpha7 Neuronal acetylcholine receptor protein alpha-7 subunit Nicotinic acetylcholine receptor alpha-7 (alpha7 nAChR)
Type:
Mol. Mass.:
56448.33
Organism:
Homo sapiens (Human)
Description:
CHRNA7 (NACHRA7)
Residue:
502
  
Inhibitor
Name:
BDBM50164959
Synonyms:
(4-Bromo-phenyl)-carbamic acid 1-aza-bicyclo[2.2.2]oct-3-yl ester US8541447, 4
Type:
Small organic molecule
Emp. Form.:
C14H17BrN2O2
Mol. Mass.:
325.201
SMILES:
Brc1ccc(NC(=O)OC2CN3CCC2CC3)cc1
: