Target
Neuronal acetylcholine receptor subunit alpha-7
Ligand
BDBM50309888
Substrate
Meas. Tech.
ChEMBL_851150 (CHEMBL2157807)
Ki
3.2±n/a nM
Citation
 Mazurov, AASpeake, JDYohannes, D Discovery and development ofa7 nicotinic acetylcholine receptor modulators. J Med Chem 54:7943-61 (2011)  
Target
Name:
Neuronal acetylcholine receptor subunit alpha-7
Synonyms:
ACHA7_HUMAN Cholinergic, Nicotinic Alpha7 Neuronal acetylcholine receptor protein alpha-7 subunit Nicotinic acetylcholine receptor alpha-7 (alpha7 nAChR)
Type:
Mol. Mass.:
56448.33
Organism:
Homo sapiens (Human)
Description:
CHRNA7 (NACHRA7)
Residue:
502
  
Inhibitor
Name:
BDBM50309888
Synonyms:
4-(6-Chloro-5-methyloxazolo[4,5-b]pyridin-2-yl)-1,4-diazabicyclo-[3.2.2]nonane | CHEMBL603052
Type:
Small organic molecule
Emp. Form.:
C14H17ClN4O
Mol. Mass.:
292.764
SMILES:
Cc1nc2nc(oc2cc1Cl)N1CCN2CCC1CC2
: