Target
Neuronal acetylcholine receptor subunit alpha-7
Ligand
BDBM50164613
Substrate
Meas. Tech.
ChEMBL_851163 (CHEMBL2157820)
Ki
92±n/a nM
Citation
 Mazurov, AASpeake, JDYohannes, D Discovery and development ofa7 nicotinic acetylcholine receptor modulators. J Med Chem 54:7943-61 (2011)  
Target
Name:
Neuronal acetylcholine receptor subunit alpha-7
Synonyms:
ACHA7_HUMAN Cholinergic, Nicotinic Alpha7 Neuronal acetylcholine receptor protein alpha-7 subunit Nicotinic acetylcholine receptor alpha-7 (alpha7 nAChR)
Type:
Mol. Mass.:
56448.33
Organism:
Homo sapiens (Human)
Description:
CHRNA7 (NACHRA7)
Residue:
502
  
Inhibitor
Name:
BDBM50164613
Synonyms:
(-)-Spiro[1-azabicyclo(2.2.2)octane-3,5'-oxazolidin-2'-one] (S)-1'-azaspiro[oxazolidine-5,8'-bicyclo[2.2.2]octan]-2-one | CHEMBL193016
Type:
Small organic molecule
Emp. Form.:
C9H14N2O2
Mol. Mass.:
182.2197
SMILES:
O=C1NC[C@@]2(CN3CCC2CC3)O1
: