Target
Delta-type/Mu-type opioid receptor
Ligand
BDBM50393257
Substrate
Meas. Tech.
ChEMBL_851398 (CHEMBL2156331)
EC50
0.000±n/a nM
Citation
 Vandormael, BFourla, DDGramowski-Voss, AKosson, PWeiss, DGSchröder, OHLipkowski, AGeorgoussi, ZTourwé, D Superpotent [Dmt¹] dermorphin tetrapeptides containing the 4-aminotetrahydro-2-benzazepin-3-one scaffold with mixedµ/d opioid receptor agonistic properties. J Med Chem 54:7848-59 (2011)  
Target
Name:
Delta-type/Mu-type opioid receptor
Synonyms:
Opioid receptors; mu and delta
Type:
Mol. Mass.:
Description:
ASSAY_ID of ChEMBL is 851397
Components:
This complex has 2 components.
Component 1
Name:
Delta-type opioid receptor
Synonyms:
DOR-1 MSL-2 OPRD_MOUSE Oprd1
Type:
Enzyme Catalytic Domain
Mol. Mass.:
40577.25
Organism:
MOUSE
Description:
P32300
Residue:
372
  
Component 2
Name:
Mu-type opioid receptor
Synonyms:
M-OR-1 Mor OPRM_MOUSE Oprm | Oprm1
Type:
Enzyme Catalytic Domain
Mol. Mass.:
44431.62
Organism:
MOUSE
Description:
OPIATE Mu OPRM1 MOUSE::P42866
Residue:
398
  
Inhibitor
Name:
BDBM50393257
Synonyms:
CHEMBL2151735
Type:
Small organic molecule
Emp. Form.:
C27H35N5O5
Mol. Mass.:
509.5973
SMILES:
C[C@@H](N(C)C(=O)[C@@H](N)Cc1c(C)cc(O)cc1C)C(=O)N[C@H]1Cc2ccccc2CN(CC(N)=O)C1=O
: