Target
Macrophage colony-stimulating factor 1 receptor
Ligand
BDBM50393539
Substrate
Meas. Tech.
ChEMBL_857181 (CHEMBL2163155)
IC50
1.1±n/a nM
Citation
 Illig, CRManthey, CLWall, MJMeegalla, SKChen, JWilson, KJBallentine, SKDesjarlais, RLSchubert, CCrysler, CSChen, YMolloy, CJChaikin, MADonatelli, RRYurkow, EZhou, ZPlayer, MRTomczuk, BE Optimization of a potent class of arylamide colony-stimulating factor-1 receptor inhibitors leading to anti-inflammatory clinical candidate 4-cyano-N-[2-(1-cyclohexen-1-yl)-4-[1-[(dimethylamino)acetyl]-4-piperidinyl]phenyl]-1H-imidazole-2-carboxamide (JNJ-28312141). J Med Chem 54:7860-83 (2011)  
Target
Name:
Macrophage colony-stimulating factor 1 receptor
Synonyms:
CSF1R FMS Macrophage colony stimulating factor receptor Macrophage colony-stimulating factor 1 receptor (c-FMS) Proto-oncogene c-Fms c-fms | cFMS
Type:
Protein
Mol. Mass.:
107979.48
Organism:
Homo sapiens (Human)
Description:
P07333
Residue:
972
  
Inhibitor
Name:
BDBM50393539
Synonyms:
CHEMBL2158225 | US8697716, 26
Type:
Small organic molecule
Emp. Form.:
C24H29N5O2
Mol. Mass.:
419.5194
SMILES:
OCCN1CCC(CC1)c1ccc(NC(=O)c2ncc([nH]2)C#N)c(c1)C1=CCCCC1
: