Target
Macrophage colony-stimulating factor 1 receptor
Ligand
BDBM50393538
Substrate
Meas. Tech.
ChEMBL_857183 (CHEMBL2163157)
IC50
4.9±n/a nM
Citation
 Illig, CRManthey, CLWall, MJMeegalla, SKChen, JWilson, KJBallentine, SKDesjarlais, RLSchubert, CCrysler, CSChen, YMolloy, CJChaikin, MADonatelli, RRYurkow, EZhou, ZPlayer, MRTomczuk, BE Optimization of a potent class of arylamide colony-stimulating factor-1 receptor inhibitors leading to anti-inflammatory clinical candidate 4-cyano-N-[2-(1-cyclohexen-1-yl)-4-[1-[(dimethylamino)acetyl]-4-piperidinyl]phenyl]-1H-imidazole-2-carboxamide (JNJ-28312141). J Med Chem 54:7860-83 (2011)  
Target
Name:
Macrophage colony-stimulating factor 1 receptor
Synonyms:
CSF1R_MOUSE Csfmr Macrophage colony-stimulating factor 1 receptor Proto-oncogene c-Fms
Type:
Protein
Mol. Mass.:
109173.45
Organism:
Mus musculus (Mouse)
Description:
P09581
Residue:
977
  
Inhibitor
Name:
BDBM50393538
Synonyms:
CHEMBL2158224
Type:
Small organic molecule
Emp. Form.:
C28H30N6O
Mol. Mass.:
466.5774
SMILES:
O=C(Nc1ccc(cc1C1=CCCCC1)C1CCN(Cc2ccccn2)CC1)c1ncc([nH]1)C#N
: