Target
Cytochrome P450 1A2
Ligand
BDBM50377058
Substrate
Meas. Tech.
ChEMBL_857198 (CHEMBL2160394)
IC50
>10000±n/a nM
Citation
 Illig, CRManthey, CLWall, MJMeegalla, SKChen, JWilson, KJBallentine, SKDesjarlais, RLSchubert, CCrysler, CSChen, YMolloy, CJChaikin, MADonatelli, RRYurkow, EZhou, ZPlayer, MRTomczuk, BE Optimization of a potent class of arylamide colony-stimulating factor-1 receptor inhibitors leading to anti-inflammatory clinical candidate 4-cyano-N-[2-(1-cyclohexen-1-yl)-4-[1-[(dimethylamino)acetyl]-4-piperidinyl]phenyl]-1H-imidazole-2-carboxamide (JNJ-28312141). J Med Chem 54:7860-83 (2011)  
Target
Name:
Cytochrome P450 1A2
Synonyms:
CP1A2_HUMAN CYPIA2 Cytochrome P(3)450 Cytochrome P450 1A2 (CYP1A2) Cytochrome P450-P3
Type:
Enzyme
Mol. Mass.:
58423.38
Organism:
Homo sapiens (Human)
Description:
P05177
Residue:
516
  
Inhibitor
Name:
BDBM50377058
Synonyms:
CHEMBL2158221 US8697716, 14
Type:
Small organic molecule
Emp. Form.:
C22H25N5O
Mol. Mass.:
375.4668
SMILES:
O=C(Nc1ccc(cc1C1=CCCCC1)C1CCNCC1)c1ncc([nH]1)C#N
: