Target
Mu-type opioid receptor
Ligand
BDBM50393722
Substrate
Meas. Tech.
ChEMBL_856831 (CHEMBL2163096)
Ki
0.300000±n/a nM
Citation
 Breslin, HJDiamond, CJKavash, RWCai, CDyatkin, ABMiskowski, TAZhang, SPWade, PRHornby, PJHe, W Identification of a duald OR antagonist/µ OR agonist as a potential therapeutic for diarrhea-predominant Irritable Bowel Syndrome (IBS-d). Bioorg Med Chem Lett 22:4869-72 (2012)  
Target
Name:
Mu-type opioid receptor
Synonyms:
MOR-1 Mu-type opioid receptor (MOR) OPRM_RAT Opioid receptor B Ror-b
Type:
G Protein-Coupled Receptor (GPCR)
Mol. Mass.:
44503.11
Organism:
Rattus norvegicus (rat)
Description:
Competition binding assays were carried out using membrane preparations from transfected HN9.10 cells that constitutively expressed the mu opioid receptor.
Residue:
398
  
Inhibitor
Name:
BDBM50393722
Synonyms:
CHEMBL2159119
Type:
Small organic molecule
Emp. Form.:
C30H33N5O2
Mol. Mass.:
495.6153
SMILES:
C[C@H](N(Cc1ccccc1)C(=O)[C@@H](N)Cc1c(C)cc(cc1C)C(N)=O)c1nc(c[nH]1)-c1ccccc1
: