Target
Delta-type opioid receptor
Ligand
BDBM50393722
Substrate
Meas. Tech.
ChEMBL_856830 (CHEMBL2163095)
Ki
12±n/a nM
Citation
 Breslin, HJDiamond, CJKavash, RWCai, CDyatkin, ABMiskowski, TAZhang, SPWade, PRHornby, PJHe, W Identification of a duald OR antagonist/µ OR agonist as a potential therapeutic for diarrhea-predominant Irritable Bowel Syndrome (IBS-d). Bioorg Med Chem Lett 22:4869-72 (2012)  
Target
Name:
Delta-type opioid receptor
Synonyms:
Cytochrome P450 3A4 Delta opioid receptor Delta-type opioid receptor (DOR) OPRD_RAT Opioid receptor Opioid receptors; mu & delta Ror-a | Voltage-gated potassium channel
Type:
G Protein-Coupled Receptor (GPCR)
Mol. Mass.:
40465.04
Organism:
Rattus norvegicus (rat)
Description:
Competition binding assays were using CHO-K1 cell membranes expressing the opioid receptor.
Residue:
372
  
Inhibitor
Name:
BDBM50393722
Synonyms:
CHEMBL2159119
Type:
Small organic molecule
Emp. Form.:
C30H33N5O2
Mol. Mass.:
495.6153
SMILES:
C[C@H](N(Cc1ccccc1)C(=O)[C@@H](N)Cc1c(C)cc(cc1C)C(N)=O)c1nc(c[nH]1)-c1ccccc1
: