Target
Delta-type opioid receptor
Ligand
BDBM50182946
Substrate
Meas. Tech.
ChEMBL_856830 (CHEMBL2163095)
Ki
14±n/a nM
Citation
 Breslin, HJDiamond, CJKavash, RWCai, CDyatkin, ABMiskowski, TAZhang, SPWade, PRHornby, PJHe, W Identification of a duald OR antagonist/µ OR agonist as a potential therapeutic for diarrhea-predominant Irritable Bowel Syndrome (IBS-d). Bioorg Med Chem Lett 22:4869-72 (2012)  
Target
Name:
Delta-type opioid receptor
Synonyms:
Cytochrome P450 3A4 Delta opioid receptor Delta-type opioid receptor (DOR) OPRD_RAT Opioid receptor Opioid receptors; mu & delta Ror-a | Voltage-gated potassium channel
Type:
G Protein-Coupled Receptor (GPCR)
Mol. Mass.:
40465.04
Organism:
Rattus norvegicus (rat)
Description:
Competition binding assays were using CHO-K1 cell membranes expressing the opioid receptor.
Residue:
372
  
Inhibitor
Name:
BDBM50182946
Synonyms:
4-((S)-2-amino-3-oxo-3-((S)-2-(4-phenyl-1H-imidazol-2-yl)piperidin-1-yl)propyl)-3,5-dimethylbenzamide | CHEMBL205049
Type:
Small organic molecule
Emp. Form.:
C26H31N5O2
Mol. Mass.:
445.5566
SMILES:
Cc1cc(cc(C)c1C[C@H](N)C(=O)N1CCCC[C@H]1c1nc(c[nH]1)-c1ccccc1)C(N)=O
: