Target
Tyrosine-protein kinase JAK1
Ligand
BDBM50393751
Substrate
Meas. Tech.
ChEMBL_856879 (CHEMBL2160360)
Ki
2±n/a nM
Citation
 Zak, MMendonca, RBalazs, MBarrett, KBergeron, PBlair, WSChang, CDeshmukh, GDevoss, JDragovich, PSEigenbrot, CGhilardi, NGibbons, PGradl, SHamman, CHanan, EJHarstad, EHewitt, PRHurley, CAJin, TJohnson, AJohnson, TKenny, JRKoehler, MFBir Kohli, PKulagowski, JJLabadie, SLiao, JLiimatta, MLin, ZLupardus, PJMaxey, RJMurray, JMPulk, RRodriguez, MSavage, SShia, SSteffek, MUbhayakar, SUltsch, Mvan Abbema, AWard, SIXiao, LXiao, Y Discovery and optimization of C-2 methyl imidazopyrrolopyridines as potent and orally bioavailable JAK1 inhibitors with selectivity over JAK2. J Med Chem 55:6176-93 (2012)  
Target
Name:
Tyrosine-protein kinase JAK1
Synonyms:
JAK-1 JAK1A JAK1_HUMAN Janus kinase 1 (JAK1) | Janus kinase 1 JAK1
Type:
Protein
Mol. Mass.:
133293.73
Organism:
Homo sapiens (Human)
Description:
P23458
Residue:
1154
  
Inhibitor
Name:
BDBM50393751
Synonyms:
CHEMBL2159204
Type:
Small organic molecule
Emp. Form.:
C14H15F2N5
Mol. Mass.:
291.2992
SMILES:
Cc1nc2cnc3[nH]ccc3c2n1C1CCNCC1(F)F
: