Target
Prolyl endopeptidase
Ligand
BDBM50393842
Substrate
Meas. Tech.
ChEMBL_855073 (CHEMBL2160635)
IC50
580±n/a nM
Citation
 De Cesco, SDeslandes, STherrien, ELevan, DCueto, MSchmidt, RCantin, LDMittermaier, AJuillerat-Jeanneret, LMoitessier, N Virtual screening and computational optimization for the discovery of covalent prolyl oligopeptidase inhibitors with activity in human cells. J Med Chem 55:6306-15 (2012)  
Target
Name:
Prolyl endopeptidase
Synonyms:
PE POP PREP Prolyl oligopeptidase
Type:
Enzyme
Mol. Mass.:
80688.50
Organism:
Homo sapiens (Human)
Description:
P48147
Residue:
710
  
Inhibitor
Name:
BDBM50393842
Synonyms:
CHEMBL2159749
Type:
Small organic molecule
Emp. Form.:
C20H20N2O2
Mol. Mass.:
320.385
SMILES:
O=C(N1CCCC1)c1cccc2CN(Cc3ccccc3)C(=O)c12
: