Target
11-beta-hydroxysteroid dehydrogenase 1
Ligand
BDBM50394017
Substrate
Meas. Tech.
ChEMBL_856054 (CHEMBL2162171)
IC50
25±n/a nM
Citation
 Scott, JSGill, ALGodfrey, LGroombridge, SDRees, ARevill, JSchofield, PSörme, PStocker, ASwales, JGWhittamore, PR Optimisation of pharmacokinetic properties in a neutral series of 11ß-HSD1 inhibitors. Bioorg Med Chem Lett 22:6756-61 (2012)  
Target
Name:
11-beta-hydroxysteroid dehydrogenase 1
Synonyms:
11-DH 11-beta-Hydroxysteroid Dehydrogenase 1 (11-beta-HSD1) 11beta-HSD1A Corticosteroid 11-beta-dehydrogenase isozyme 1 (11-beta-HSD-1) Hsd11 | Hsd11b1
Type:
Enzyme
Mol. Mass.:
32369.70
Organism:
Mus musculus (mouse)
Description:
P50172
Residue:
292
  
Inhibitor
Name:
BDBM50394017
Synonyms:
CHEMBL2158470
Type:
Small organic molecule
Emp. Form.:
C23H33N3O3S
Mol. Mass.:
431.591
SMILES:
CCCSc1nc(ccc1C(=O)N[C@H]1C2CC3CC1C[C@](O)(C3)C2)N1CCOCC1
: