Target
11-beta-hydroxysteroid dehydrogenase 1
Ligand
BDBM50394012
Substrate
Meas. Tech.
ChEMBL_855921 (CHEMBL2161684)
IC50
10±n/a nM
Citation
 Scott, JSGill, ALGodfrey, LGroombridge, SDRees, ARevill, JSchofield, PSörme, PStocker, ASwales, JGWhittamore, PR Optimisation of pharmacokinetic properties in a neutral series of 11ß-HSD1 inhibitors. Bioorg Med Chem Lett 22:6756-61 (2012)  
Target
Name:
11-beta-hydroxysteroid dehydrogenase 1
Synonyms:
11-DH 11-beta-Hydroxysteroid Dehydrogenase 1 (11-beta-HSD1) 11-beta-hydroxysteroid dehydrogenase 1 (11HSD1) Corticosteroid 11-beta-dehydrogenase isozyme 1 (11-beta-HSD-1) Corticosteroid 11-beta-dehydrogenase isozyme 1 (11beta-HSD1) HSD11 HSD11L | SDR26C1
Type:
Enzyme
Mol. Mass.:
32409.16
Organism:
Homo sapiens (Human)
Description:
P28845
Residue:
292
  
Inhibitor
Name:
BDBM50394012
Synonyms:
CHEMBL2158465
Type:
Small organic molecule
Emp. Form.:
C19H27N3O2S
Mol. Mass.:
361.502
SMILES:
CCCSc1nc(C)ncc1C(=O)N[C@H]1C2CC3CC1C[C@](O)(C3)C2
: