Target
Adenosine receptor A2a
Ligand
BDBM50316887
Substrate
Meas. Tech.
ChEMBL_858812 (CHEMBL2167687)
Ki
6.5±n/a nM
Citation
 Shook, BCRassnick, SWallace, NCrooke, JAult, MChakravarty, DBarbay, JKWang, APowell, MTLeonard, KAlford, VScannevin, RHCarroll, KLampron, LWestover, LLim, HKRussell, RBranum, SWells, KMDamon, SYouells, SLi, XBeauchamp, DARhodes, KJackson, PF Design and characterization of optimized adenosine A2A/A1 receptor antagonists for the treatment of Parkinson's disease. J Med Chem 55:1402-17 (2012)  
Target
Name:
Adenosine receptor A2a
Synonyms:
A2A adenosine receptor (hA2A) ADENOSINE A2 ADORA2 Adenosine A2A receptor (A2AAR)
Type:
G Protein-Coupled Receptor (GPCR)
Mol. Mass.:
44716.46
Organism:
Homo sapiens (Human)
Description:
P29274
Residue:
412
  
Inhibitor
Name:
BDBM50316887
Synonyms:
2-amino-8-(2-morpholinoethoxy)-4-phenyl-5H-indeno[1,2-d]pyrimidin-5-one | CHEMBL1095488
Type:
Small organic molecule
Emp. Form.:
C23H22N4O3
Mol. Mass.:
402.4458
SMILES:
Nc1nc2-c3cc(OCCN4CCOCC4)ccc3C(=O)c2c(n1)-c1ccccc1
: