Target
Adenosine receptor A2a
Ligand
BDBM50394718
Substrate
Meas. Tech.
ChEMBL_858812 (CHEMBL2167687)
Ki
0.1±n/a nM
Citation
 Shook, BCRassnick, SWallace, NCrooke, JAult, MChakravarty, DBarbay, JKWang, APowell, MTLeonard, KAlford, VScannevin, RHCarroll, KLampron, LWestover, LLim, HKRussell, RBranum, SWells, KMDamon, SYouells, SLi, XBeauchamp, DARhodes, KJackson, PF Design and characterization of optimized adenosine A2A/A1 receptor antagonists for the treatment of Parkinson's disease. J Med Chem 55:1402-17 (2012)  
Target
Name:
Adenosine receptor A2a
Synonyms:
A2A adenosine receptor (hA2A) ADENOSINE A2 ADORA2 Adenosine A2A receptor (A2AAR)
Type:
G Protein-Coupled Receptor (GPCR)
Mol. Mass.:
44716.46
Organism:
Homo sapiens (Human)
Description:
P29274
Residue:
412
  
Inhibitor
Name:
BDBM50394718
Synonyms:
CHEMBL2165801
Type:
Small organic molecule
Emp. Form.:
C23H15ClN4O
Mol. Mass.:
398.844
SMILES:
Nc1nc2-c3cc(Cc4cnccc4Cl)ccc3C(=O)c2c(n1)-c1ccccc1
: