Target
D(3) dopamine receptor
Ligand
BDBM50394930
Substrate
Meas. Tech.
ChEMBL_860682 (CHEMBL2167999)
Ki
197.4±n/a nM
Citation
 Newman, AHBeuming, TBanala, AKDonthamsetti, PPongetti, KLaBounty, ALevy, BCao, JMichino, MLuedtke, RRJavitch, JAShi, L Molecular determinants of selectivity and efficacy at the dopamine D3 receptor. J Med Chem 55:6689-99 (2012)  
Target
Name:
D(3) dopamine receptor
Synonyms:
DOPAMINE D3 DRD3_HUMAN Dopamine D3 receptor (D3) Dopamine receptor Dopamine receptor D3
Type:
Mol. Mass.:
44243.43
Organism:
Homo sapiens (Human)
Description:
Residue:
400
  
Inhibitor
Name:
BDBM50394930
Synonyms:
CHEMBL1424807
Type:
Small organic molecule
Emp. Form.:
C10H12Cl2N2
Mol. Mass.:
231.122
SMILES:
Clc1cccc(N2CCNCC2)c1Cl
: