Target
Mu-type opioid receptor
Ligand
BDBM50395059
Substrate
Meas. Tech.
ChEMBL_859256 (CHEMBL2166341)
EC50
0.034200±n/a nM
Citation
 Wang, YXing, YLiu, XJi, HKai, MChen, ZYu, JZhao, DRen, HWang, R A new class of highly potent and selective endomorphin-1 analogues containinga-methylene-ß-aminopropanoic acids (map). J Med Chem 55:6224-36 (2012)  
Target
Name:
Mu-type opioid receptor
Synonyms:
M-OR-1 MOR-1 MUOR1 Mu opiate receptor OPRM1 hMOP | mu-type opioid receptor isoform MOR-1
Type:
G Protein-Coupled Receptor (GPCR)
Mol. Mass.:
44789.51
Organism:
Homo sapiens (Human)
Description:
P35372
Residue:
400
  
Inhibitor
Name:
BDBM50395059
Synonyms:
CHEMBL2163917
Type:
Small organic molecule
Emp. Form.:
C33H36N6O6
Mol. Mass.:
612.6755
SMILES:
N[C@@H](Cc1ccc(O)cc1)C(=O)N1CCC[C@H]1C(=O)N[C@@H](Cc1c[nH]c2ccccc12)C(=O)N[C@H](C(=C)C(N)=O)c1ccoc1
: