Target
Lysine-specific demethylase 5C
Ligand
BDBM50129197
Substrate
Meas. Tech.
ChEMBL_859440 (CHEMBL2167518)
IC50
1900±n/a nM
Citation
 Rose, NRWoon, ECTumber, AWalport, LJChowdhury, RLi, XSKing, ONLejeune, CNg, SSKrojer, TChan, MCRydzik, AMHopkinson, RJChe, KHDaniel, MStrain-Damerell, CGileadi, CKochan, GLeung, IKDunford, JYeoh, KKRatcliffe, PJBurgess-Brown, Nvon Delft, FMuller, SMarsden, BBrennan, PEMcDonough, MAOppermann, UKlose, RJSchofield, CJKawamura, A Plant growth regulator daminozide is a selective inhibitor of human KDM2/7 histone demethylases. J Med Chem 55:6639-43 (2012)  
Target
Name:
Lysine-specific demethylase 5C
Synonyms:
DXS1272E JARID1C KDM5C Lysine-specific demethylase 5C (KDM5C) Protein SmcX SMCX | XE169
Type:
PROTEIN
Mol. Mass.:
175691.17
Organism:
Homo sapiens (Human)
Description:
P41229
Residue:
1560
  
Inhibitor
Name:
BDBM50129197
Synonyms:
4-(Hydroxyamino)-4-oxobutanoic acid N-Hydroxy-succinamic acid
Type:
Small organic molecule
Emp. Form.:
C4H7NO4
Mol. Mass.:
133.1027
SMILES:
ONC(=O)CCC(O)=O
: