Target
Adenosine receptor A1
Ligand
BDBM50395122
Substrate
Meas. Tech.
ChEMBL_859785 (CHEMBL2169613)
Ki
36±n/a nM
Citation
 Korboukh, IHull-Ryde, EARittiner, JERandhawa, ASColeman, JFitzpatrick, BJSetola, VJanzen, WPFrye, SVZylka, MJJin, J Orally active adenosine A(1) receptor agonists with antinociceptive effects in mice. J Med Chem 55:6467-77 (2012)  
Target
Name:
Adenosine receptor A1
Synonyms:
A1 adenosine receptor (hA1) AA1R_HUMAN ADORA1 Adenosine A1-receptor Adenosine receptor A1 (hA1) | Adenosine transporter (AdT)
Type:
G Protein-Coupled Receptor (GPCR)
Mol. Mass.:
36520.92
Organism:
Homo sapiens (Human)
Description:
P30542
Residue:
326
  
Inhibitor
Name:
BDBM50395122
Synonyms:
CHEMBL2163561
Type:
Small organic molecule
Emp. Form.:
C17H25ClN5O7P
Mol. Mass.:
477.836
SMILES:
COP(=O)(OC)OC[C@H]1O[C@H]([C@H](O)[C@@H]1O)n1cnc2c(NC3CCCC3)nc(Cl)nc12
: