Target
Histamine H1 receptor
Ligand
BDBM31046
Substrate
Meas. Tech.
ChEMBL_858531 (CHEMBL2169535)
IC50
12589.25±n/a nM
Citation
 Vasudevan, SRMoore, JBSchymura, YChurchill, GC Shape-based reprofiling of FDA-approved drugs for the H1 histamine receptor. J Med Chem 55:7054-60 (2012)  
Target
Name:
Histamine H1 receptor
Synonyms:
HISTAMINE H1 Hrh1
Type:
Enzyme Catalytic Domain
Mol. Mass.:
55716.35
Organism:
RAT
Description:
HISTAMINE H1 HRH1 RAT::P31390
Residue:
486
  
Inhibitor
Name:
BDBM31046
Synonyms:
3-[4,5-dihydro-1H-imidazol-2-ylmethyl-(4-methylphenyl)amino]phenol;methanesulfonic acid 3-[N-(2-imidazolin-2-ylmethyl)-4-methyl-anilino]phenol;mesylic acid MLS000069487 PHENTOLAMINE MESYLATE cid_5775 | cid_91430
Type:
Small organic molecule
Emp. Form.:
C17H19N3O
Mol. Mass.:
281.3523
SMILES:
Cc1ccc(cc1)N(CC1=NCCN1)c1cccc(O)c1
: