Target
A disintegrin and metalloproteinase with thrombospondin motifs 1
Ligand
BDBM50395680
Substrate
Meas. Tech.
ChEMBL_860059 (CHEMBL2167995)
IC50
>50000±n/a nM
Citation
 Deng, HO'Keefe, HDavie, CPLind, KEAcharya, RAFranklin, GJLarkin, JMatico, RNeeb, MThompson, MMLohr, TGross, JWCentrella, PAO'Donovan, GKBedard, KLvan Vloten, KMataruse, SSkinner, SRBelyanskaya, SLCarpenter, TYShearer, TWClark, MACuozzo, JWArico-Muendel, CCMorgan, BA Discovery of highly potent and selective small molecule ADAMTS-5 inhibitors that inhibit human cartilage degradation via encoded library technology (ELT). J Med Chem 55:7061-79 (2012)  
Target
Name:
A disintegrin and metalloproteinase with thrombospondin motifs 1
Synonyms:
ADAMTS1 KIAA1346 | METH1
Type:
PROTEIN
Mol. Mass.:
105362.16
Organism:
Homo sapiens (Human)
Description:
ChEMBL_860059
Residue:
967
  
Inhibitor
Name:
BDBM50395680
Synonyms:
CHEMBL2164120
Type:
Small organic molecule
Emp. Form.:
C27H29F3N8O2S3
Mol. Mass.:
650.762
SMILES:
FC(F)(F)c1ccc(cc1)S(=O)(=O)NC[C@H]1CCCN1c1nc(NCCC=C)nc(NCc2csc(n2)-c2cccs2)n1
: