Target
Lysine-specific histone demethylase 1A
Ligand
BDBM50185388
Substrate
Meas. Tech.
ChEMBL_861226 (CHEMBL2173364)
IC50
500±n/a nM
Citation
 Decarlo, DHadden, MK Oncoepigenomics: making histone lysine methylation count. Eur J Med Chem 56:179-194 (2012)  
Target
Name:
Lysine-specific histone demethylase 1A
Synonyms:
AOF2 Flavin-containing amine oxidase domain-containing protein 2 KDM1A KIAA0601 Lysine-specific demethylase 1 (LSD1) Lysine-specific histone demethylase 1 (LSD1)
Type:
Enzyme
Mol. Mass.:
92901.01
Organism:
Homo sapiens (Human)
Description:
O60341
Residue:
852
  
Inhibitor
Name:
BDBM50185388
Synonyms:
CHEMBL378900 | N-(3,3-diphenylpropyl)-1-3-[3-({7-[(3-{N-[3-(3,3-diphenylpropyl)carbamimidamidomethanimidoyl]amino}propyl)amino]heptyl}amino)propyl]carbamimidamidomethanimidamide
Type:
Small organic molecule
Emp. Form.:
C47H68N12
Mol. Mass.:
801.1232
SMILES:
NC(NC(=N)NCCC(c1ccccc1)c1ccccc1)=NCCCNCCCCCCCNCCCN=C(N)NC(=N)NCCC(c1ccccc1)c1ccccc1
: