Target
Histone-lysine N-methyltransferase EHMT2
Ligand
BDBM50353128
Substrate
Meas. Tech.
ChEMBL_861223 (CHEMBL2173361)
IC50
81±n/a nM
Citation
 Decarlo, DHadden, MK Oncoepigenomics: making histone lysine methylation count. Eur J Med Chem 56:179-194 (2012)  
Target
Name:
Histone-lysine N-methyltransferase EHMT2
Synonyms:
BAT8 EHMT2 G9A Histone-lysine N-methyltransferase EHMT1/EHMT2 KMT1C Protein G9a (G9a)
Type:
Enzyme
Mol. Mass.:
132339.87
Organism:
Homo sapiens (Human)
Description:
Q96KQ7
Residue:
1210
  
Inhibitor
Name:
BDBM50353128
Synonyms:
CHEMBL1231795
Type:
Small organic molecule
Emp. Form.:
C30H47N5O2
Mol. Mass.:
509.7265
SMILES:
COc1cc2c(NC3CCN(CC3)C(C)C)nc(nc2cc1OCCCN1CCCC1)C1CCCCC1
: