Target
Histone-lysine N-methyltransferase EHMT2
Ligand
BDBM50396024
Substrate
Meas. Tech.
ChEMBL_861230 (CHEMBL2173368)
Kd
164±n/a nM
Citation
 Decarlo, DHadden, MK Oncoepigenomics: making histone lysine methylation count. Eur J Med Chem 56:179-194 (2012)  
Target
Name:
Histone-lysine N-methyltransferase EHMT2
Synonyms:
BAT8 EHMT2 G9A Histone-lysine N-methyltransferase EHMT1/EHMT2 KMT1C Protein G9a (G9a)
Type:
Enzyme
Mol. Mass.:
132339.87
Organism:
Homo sapiens (Human)
Description:
Q96KQ7
Residue:
1210
  
Inhibitor
Name:
BDBM50396024
Synonyms:
CHEMBL1232453
Type:
Small organic molecule
Emp. Form.:
C29H52N8O2
Mol. Mass.:
544.7756
SMILES:
COc1cc2c(NC3CCN(CCCCCN)CC3)nc(NCCCN(C)C)nc2cc1OCCCCCN
: