Target
Tyrosine-protein kinase SYK
Ligand
BDBM50126423
Substrate
Meas. Tech.
ChEMBL_861815 (CHEMBL2173408)
IC50
200±n/a nM
Citation
 Singh, RMasuda, ESPayan, DG Discovery and development of spleen tyrosine kinase (SYK) inhibitors. J Med Chem 55:3614-43 (2012)  
Target
Name:
Tyrosine-protein kinase SYK
Synonyms:
KSYK_HUMAN Spleen Tyrosine Kinase Tyrosine-protein kinase SYK (Syk)
Type:
Enzyme
Mol. Mass.:
72079.99
Organism:
Homo sapiens (Human)
Description:
P43405
Residue:
635
  
Inhibitor
Name:
BDBM50126423
Synonyms:
4-[7-(4-Dimethylamino-phenyl)-[1,6]naphthyridin-5-ylamino]-butan-1-ol | CHEMBL30355
Type:
Small organic molecule
Emp. Form.:
C20H24N4O
Mol. Mass.:
336.4308
SMILES:
CN(C)c1ccc(cc1)-c1cc2ncccc2c(NCCCCO)n1
: