Target
Tyrosine-protein kinase SYK
Ligand
BDBM50126437
Substrate
Meas. Tech.
ChEMBL_861815 (CHEMBL2173408)
IC50
190±n/a nM
Citation
 Singh, RMasuda, ESPayan, DG Discovery and development of spleen tyrosine kinase (SYK) inhibitors. J Med Chem 55:3614-43 (2012)  
Target
Name:
Tyrosine-protein kinase SYK
Synonyms:
KSYK_HUMAN Spleen Tyrosine Kinase Tyrosine-protein kinase SYK (Syk)
Type:
Enzyme
Mol. Mass.:
72079.99
Organism:
Homo sapiens (Human)
Description:
P43405
Residue:
635
  
Inhibitor
Name:
BDBM50126437
Synonyms:
CHEMBL30826 N1-(7-(4-(dimethylamino)phenyl)-1,6-naphthyridin-5-yl)ethane-1,2-diamine
Type:
Small organic molecule
Emp. Form.:
C18H21N5
Mol. Mass.:
307.3928
SMILES:
CN(C)c1ccc(cc1)-c1cc2ncccc2c(NCCN)n1
: