Target
Tyrosine-protein kinase SYK
Ligand
BDBM50132451
Substrate
Meas. Tech.
ChEMBL_861815 (CHEMBL2173408)
IC50
145±n/a nM
Citation
 Singh, RMasuda, ESPayan, DG Discovery and development of spleen tyrosine kinase (SYK) inhibitors. J Med Chem 55:3614-43 (2012)  
Target
Name:
Tyrosine-protein kinase SYK
Synonyms:
KSYK_HUMAN Spleen Tyrosine Kinase Tyrosine-protein kinase SYK (Syk)
Type:
Enzyme
Mol. Mass.:
72079.99
Organism:
Homo sapiens (Human)
Description:
P43405
Residue:
635
  
Inhibitor
Name:
BDBM50132451
Synonyms:
3-((5-methoxy-1-methyl-1H-indol-3-yl)methylene)-N-methyl-2-oxoindoline-5-carboxamide CHEMBL318079
Type:
Small organic molecule
Emp. Form.:
C21H19N3O3
Mol. Mass.:
361.3939
SMILES:
CNC(=O)c1ccc2NC(=O)\C(=C/c3cn(C)c4ccc(OC)cc34)c2c1
: