Target
Tyrosine-protein kinase SYK
Ligand
BDBM50396077
Substrate
Meas. Tech.
ChEMBL_861816 (CHEMBL2173409)
IC50
570±n/a nM
Citation
 Singh, RMasuda, ESPayan, DG Discovery and development of spleen tyrosine kinase (SYK) inhibitors. J Med Chem 55:3614-43 (2012)  
Target
Name:
Tyrosine-protein kinase SYK
Synonyms:
KSYK_HUMAN Spleen Tyrosine Kinase Tyrosine-protein kinase SYK (Syk)
Type:
Enzyme
Mol. Mass.:
72079.99
Organism:
Homo sapiens (Human)
Description:
P43405
Residue:
635
  
Inhibitor
Name:
BDBM50396077
Synonyms:
CHEMBL1229525
Type:
Small organic molecule
Emp. Form.:
C21H22N4O2
Mol. Mass.:
362.425
SMILES:
Cn1cc(-c2cc3cccnc3[nH]2)c2cc(ccc12)C(=O)NC(C)(C)CO
: