Target
Leucine-rich repeat serine/threonine-protein kinase 2
Ligand
BDBM50396149
Substrate
Meas. Tech.
ChEMBL_862779 (CHEMBL2174491)
Ki
71±n/a nM
Citation
 Chen, HChan, BKDrummond, JEstrada, AAGunzner-Toste, JLiu, XLiu, YMoffat, JShore, DSweeney, ZKTran, TWang, SZhao, GZhu, HBurdick, DJ Discovery of selective LRRK2 inhibitors guided by computational analysis and molecular modeling. J Med Chem 55:5536-45 (2012)  
Target
Name:
Leucine-rich repeat serine/threonine-protein kinase 2
Synonyms:
Dardarin LRRK2_HUMAN Leucine-rich repeat serine/threonine-protein kinase 2 PARK8
Type:
Protein
Mol. Mass.:
286113.20
Organism:
Homo sapiens (Human)
Description:
Q5S007
Residue:
2527
  
Inhibitor
Name:
BDBM50396149
Synonyms:
CHEMBL2171744
Type:
Small organic molecule
Emp. Form.:
C17H20FN5O3
Mol. Mass.:
361.3708
SMILES:
CNc1nc(Nc2ccc(cc2OC)C(=O)N2CCOCC2)ncc1F
: