Target
Kallikrein-1
Ligand
BDBM50396164
Substrate
Meas. Tech.
ChEMBL_862796 (CHEMBL2172816)
Ki
8±n/a nM
Citation
 Caliendo, GSantagada, VPerissutti, ESeverino, BFiorino, FFrecentese, FJuliano, L Kallikrein protease activated receptor (PAR) axis: an attractive target for drug development. J Med Chem 55:6669-86 (2012)  
Target
Name:
Kallikrein-1
Synonyms:
KLK1 Kallikrein 1 Kidney/pancreas/salivary gland kallikrein | Tissue kallikrein
Type:
Enzyme
Mol. Mass.:
28874.69
Organism:
Homo sapiens (Human)
Description:
P06870
Residue:
262
  
Inhibitor
Name:
BDBM50396164
Synonyms:
CHEMBL2171751
Type:
Small organic molecule
Emp. Form.:
C42H60N8O9
Mol. Mass.:
820.974
SMILES:
CC(C)C[C@H](NC(=O)[C@@H]1CCCN1C(=O)[C@H](Cc1ccccc1)NC(=O)[C@H](Cc1ccccc1)NC(=O)[C@@H](CCCCN)NC(C)=O)C(=O)N[C@@H](CCC(O)=O)C(N)=O
: