Target
ALK tyrosine kinase receptor
Ligand
BDBM50396246
Substrate
Meas. Tech.
ChEMBL_863887 (CHEMBL2176371)
IC50
2±n/a nM
Citation
 Lewis, RTBode, CMChoquette, DMPotashman, MRomero, KStellwagen, JCTeffera, YMoore, EWhittington, DAChen, HEpstein, LFEmkey, RAndrews, PSYu, VLSaffran, DCXu, MDrew, AMerkel, PSzilvassy, SBrake, RL The discovery and optimization of a novel class of potent, selective, and orally bioavailable anaplastic lymphoma kinase (ALK) inhibitors with potential utility for the treatment of cancer. J Med Chem 55:6523-40 (2012)  
Target
Name:
ALK tyrosine kinase receptor
Synonyms:
ALK ALK_HUMAN CD_antigen: CD246
Type:
Protein
Mol. Mass.:
176453.10
Organism:
Homo sapiens (Human)
Description:
Q9UM73
Residue:
1620
  
Inhibitor
Name:
BDBM50396246
Synonyms:
CHEMBL2172305
Type:
Small organic molecule
Emp. Form.:
C31H38FN5O4
Mol. Mass.:
563.6629
SMILES:
CC(C)NC(=O)[C@H]1CC[C@H](CC1)n1c(NC(=O)c2ccc(F)cc2)nc2ccc(CN3CCC(CC3)C(O)=O)cc12
: