Target
Aldo-keto reductase family 1 member C4
Ligand
BDBM50396697
Substrate
Meas. Tech.
ChEMBL_864143 (CHEMBL2174991)
IC50
>30000±n/a nM
Citation
 Jamieson, SMBrooke, DGHeinrich, DAtwell, GJSilva, SHamilton, EJTurnbull, APRigoreau, LJTrivier, ESoudy, CSamlal, SSOwen, PJSchroeder, ERaynham, TFlanagan, JUDenny, WA 3-(3,4-Dihydroisoquinolin-2(1H)-ylsulfonyl)benzoic Acids: highly potent and selective inhibitors of the type 5 17-ß-hydroxysteroid dehydrogenase AKR1C3. J Med Chem 55:7746-58 (2012)  
Target
Name:
Aldo-keto reductase family 1 member C4
Synonyms:
3-alpha-HSD1 3-alpha-hydroxysteroid dehydrogenase type I AKR1C4 Aldo-keto reductase family 1 member C4 (AK1C4) CHDR DD-4 Dihydrodiol dehydrogenase 4 | HAKRA
Type:
Enzyme
Mol. Mass.:
37068.40
Organism:
Homo sapiens (Human)
Description:
P17516
Residue:
323
  
Inhibitor
Name:
BDBM50396697
Synonyms:
CHEMBL2172060
Type:
Small organic molecule
Emp. Form.:
C18H18ClNO4S
Mol. Mass.:
379.858
SMILES:
OC(=O)C1CCCN(C1)S(=O)(=O)c1ccc(cc1)-c1ccccc1Cl
: