Target
7-dehydrocholesterol reductase
Ligand
BDBM50396753
Substrate
Meas. Tech.
ChEMBL_864350 (CHEMBL2175827)
IC50
120±n/a nM
Citation
 Horling, AMüller, CBarthel, RBracher, FImming, P A new class of selective and potent 7-dehydrocholesterol reductase inhibitors. J Med Chem 55:7614-22 (2012)  
Target
Name:
7-dehydrocholesterol reductase
Synonyms:
7-DHC reductase Anti-estrogen binding site (AEBS) DHCR7 Putative sterol reductase SR-2 | Sterol Delta(7)-reductase
Type:
PROTEIN
Mol. Mass.:
54508.42
Organism:
Homo sapiens (Human)
Description:
ChEMBL_864350
Residue:
475
  
Inhibitor
Name:
BDBM50396753
Synonyms:
CHEMBL2172349
Type:
Small organic molecule
Emp. Form.:
C19H23NO3
Mol. Mass.:
313.3908
SMILES:
COc1cccc(CCN2CCc3cc(O)c(OC)cc3C2)c1
: