Target
cAMP-specific 3',5'-cyclic phosphodiesterase 4C
Ligand
BDBM14361
Substrate
Meas. Tech.
ChEMBL_864910 (CHEMBL2175753)
IC50
3690±n/a nM
Citation
 Kümmerle, AESchmitt, MCardozo, SVLugnier, CVilla, PLopes, ABRomeiro, NCJustiniano, HMartins, MAFraga, CABourguignon, JJBarreiro, EJ Design, synthesis, and pharmacological evaluation of N-acylhydrazones and novel conformationally constrained compounds as selective and potent orally active phosphodiesterase-4 inhibitors. J Med Chem 55:7525-45 (2012)  
Target
Name:
cAMP-specific 3',5'-cyclic phosphodiesterase 4C
Synonyms:
3',5'-cyclic phosphodiesterase NP_000914.2 PDE4C | PDE4C1
Type:
Enzyme Catalytic Domain
Mol. Mass.:
79875.54
Organism:
Homo sapiens (Human)
Description:
Q08493
Residue:
712
  
Inhibitor
Name:
BDBM14361
Synonyms:
(R,S)-Rolipram 4-[3-(cyclopentyloxy)-4-methoxyphenyl]pyrrolidin-2-one CHEMBL63 | Rolipram
Type:
Small organic molecule
Emp. Form.:
C16H21NO3
Mol. Mass.:
275.3428
SMILES:
COc1ccc(cc1OC1CCCC1)C1CNC(=O)C1
: